Target
NAD-dependent protein deacetylase sirtuin-2
Ligand
BDBM50576705
Substrate
Meas. Tech.
ChEMBL_2127690 (CHEMBL4837035)
Ki
56000±n/a nM
Citation
 Zhou, YShen, WPeng, JDeng, YLi, X Identification of isoform/domain-selective fragments from the selection of DNA-encoded dynamic library. Bioorg Med Chem 45:0 (2021)  
Target
Name:
NAD-dependent protein deacetylase sirtuin-2
Synonyms:
NAD-Dependent Deacetylase Sirtuin-2 NAD-dependent deacetylase sirtuin 3 SIR2-like SIR2L SIR2_HUMAN Sirtuin 2 (SIRT2)
Type:
Hydrolase
Mol. Mass.:
43172.62
Organism:
Homo sapiens (Human)
Description:
Residue:
389
  
Inhibitor
Name:
BDBM50576705
Synonyms:
CHEMBL4850364
Type:
Small organic molecule
Emp. Form.:
C36H37FN8O5
Mol. Mass.:
680.728
SMILES:
CC1COc2c(N3CCN(C)CC3)c(F)cc3c2n1cc(C(=O)NCc1ccc(CNC(=O)CCc2nc(no2)-c2ccncc2)cc1)c3=O
: