Target
NAD-dependent protein deacetylase sirtuin-2
Ligand
BDBM50576703
Substrate
Meas. Tech.
ChEMBL_2127690 (CHEMBL4837035)
Ki
28000±n/a nM
Citation
 Zhou, YShen, WPeng, JDeng, YLi, X Identification of isoform/domain-selective fragments from the selection of DNA-encoded dynamic library. Bioorg Med Chem 45:0 (2021)  
Target
Name:
NAD-dependent protein deacetylase sirtuin-2
Synonyms:
NAD-Dependent Deacetylase Sirtuin-2 NAD-dependent deacetylase sirtuin 3 SIR2-like SIR2L SIR2_HUMAN Sirtuin 2 (SIRT2)
Type:
Hydrolase
Mol. Mass.:
43172.62
Organism:
Homo sapiens (Human)
Description:
Residue:
389
  
Inhibitor
Name:
BDBM50576703
Synonyms:
CHEMBL4866650
Type:
Small organic molecule
Emp. Form.:
C29H35N3O7
Mol. Mass.:
537.6041
SMILES:
COc1cc(CC(=O)NCCOCCOCCNC(=O)c2cccc(c2)-c2cccnc2)cc(OC)c1OC
: