Target
NAD-dependent protein deacetylase sirtuin-2
Ligand
BDBM50576693
Substrate
Meas. Tech.
ChEMBL_2127690 (CHEMBL4837035)
Ki
9000±n/a nM
Citation
 Zhou, YShen, WPeng, JDeng, YLi, X Identification of isoform/domain-selective fragments from the selection of DNA-encoded dynamic library. Bioorg Med Chem 45:0 (2021)  
Target
Name:
NAD-dependent protein deacetylase sirtuin-2
Synonyms:
NAD-Dependent Deacetylase Sirtuin-2 NAD-dependent deacetylase sirtuin 3 SIR2-like SIR2L SIR2_HUMAN Sirtuin 2 (SIRT2)
Type:
Hydrolase
Mol. Mass.:
43172.62
Organism:
Homo sapiens (Human)
Description:
Residue:
389
  
Inhibitor
Name:
BDBM50576693
Synonyms:
CHEMBL4866103
Type:
Small organic molecule
Emp. Form.:
C35H46FN5O7
Mol. Mass.:
667.7674
SMILES:
COc1cc(CC(=O)NCCCCCCNC(=O)c2cn3C(C)COc4c(N5CCN(C)CC5)c(F)cc(c34)c2=O)cc(OC)c1OC
: