Target
Neuronal acetylcholine receptor subunit alpha-3/beta-2
Ligand
BDBM50100717
Substrate
Meas. Tech.
ChEMBL_143251 (CHEMBL752539)
Ki
0.003±n/a nM
Citation
 Carroll, FI Epibatidine structure-activity relationships. Bioorg Med Chem Lett 14:1889-96 (2004)  
Target
Name:
Neuronal acetylcholine receptor subunit alpha-3/beta-2
Synonyms:
Neuronal acetylcholine receptor Alpha-3/Beta-2 Neuronal acetylcholine receptor; alpha3/beta2 | nAChR subtypes alpha3 beta2
Type:
Protein
Mol. Mass.:
Description:
Components:
This complex has 2 components.
Component 1
Name:
Neuronal acetylcholine receptor subunit alpha-3
Synonyms:
ACHA3_RAT Chrna3
Type:
Enzyme
Mol. Mass.:
56995.52
Organism:
Rattus norvegicus (Rat)
Description:
P04757
Residue:
499
  
Component 2
Name:
Neuronal acetylcholine receptor subunit beta-2
Synonyms:
ACHB2_RAT Chrnb2 Neuronal acetylcholine receptor non-alpha-1 chain
Type:
Enzyme
Mol. Mass.:
56910.32
Organism:
Rattus norvegicus (Rat)
Description:
P12390
Residue:
500
  
Inhibitor
Name:
BDBM50100717
Synonyms:
2-(pyridin-3-yl)-7-aza-bicyclo[2.2.1]heptane CHEMBL56817
Type:
Small organic molecule
Emp. Form.:
C11H14N2
Mol. Mass.:
174.2423
SMILES:
C1CC2NC1CC2c1cccnc1
: