Target
Low molecular weight phosphotyrosine protein phosphatase
Ligand
BDBM50576919
Substrate
Meas. Tech.
ChEMBL_2128506 (CHEMBL4837935)
IC50
239±n/a nM
Citation
 Stanford, SMDiaz, MAArdecky, RJZou, JRoosild, THolmes, ZJNguyen, TPHedrick, MPRodiles, SGuan, AGrotegut, SSantelli, EChung, TDYJackson, MRBottini, NPinkerton, AB Discovery of Orally Bioavailable Purine-Based Inhibitors of the Low-Molecular-Weight Protein Tyrosine Phosphatase. J Med Chem 64:5645-5653 (2021)  
Target
Name:
Low molecular weight phosphotyrosine protein phosphatase
Synonyms:
3.1.3.2 ACP1 LMW-PTP LMWPTP PPAC_HUMAN low molecular weight phosphotyrosine protein phosphatase isoform c
Type:
Mol. Mass.:
18042.81
Organism:
Homo sapiens (Human)
Description:
P24666
Residue:
158
  
Inhibitor
Name:
BDBM50576919
Synonyms:
CHEMBL4847980
Type:
Small organic molecule
Emp. Form.:
C12H9Cl2N5
Mol. Mass.:
294.139
SMILES:
Nc1ncn(Cc2c(Cl)cccc2Cl)c2ncnc12
: