Target
Low molecular weight phosphotyrosine protein phosphatase
Ligand
BDBM50576934
Substrate
Meas. Tech.
ChEMBL_2128506 (CHEMBL4837935)
IC50
245±n/a nM
Citation
 Stanford, SMDiaz, MAArdecky, RJZou, JRoosild, THolmes, ZJNguyen, TPHedrick, MPRodiles, SGuan, AGrotegut, SSantelli, EChung, TDYJackson, MRBottini, NPinkerton, AB Discovery of Orally Bioavailable Purine-Based Inhibitors of the Low-Molecular-Weight Protein Tyrosine Phosphatase. J Med Chem 64:5645-5653 (2021)  
Target
Name:
Low molecular weight phosphotyrosine protein phosphatase
Synonyms:
3.1.3.2 ACP1 LMW-PTP LMWPTP PPAC_HUMAN low molecular weight phosphotyrosine protein phosphatase isoform c
Type:
Mol. Mass.:
18042.81
Organism:
Homo sapiens (Human)
Description:
P24666
Residue:
158
  
Inhibitor
Name:
BDBM50576934
Synonyms:
CHEMBL4868378
Type:
Small organic molecule
Emp. Form.:
C19H12Cl2N6
Mol. Mass.:
395.245
SMILES:
Nc1ncn(Cc2c(Cl)cccc2Cl)c2nc(nc12)-c1ccccc1C#N
: