Target
Low molecular weight phosphotyrosine protein phosphatase
Ligand
BDBM50576941
Substrate
Meas. Tech.
ChEMBL_2128506 (CHEMBL4837935)
IC50
6.0±n/a nM
Citation
 Stanford, SMDiaz, MAArdecky, RJZou, JRoosild, THolmes, ZJNguyen, TPHedrick, MPRodiles, SGuan, AGrotegut, SSantelli, EChung, TDYJackson, MRBottini, NPinkerton, AB Discovery of Orally Bioavailable Purine-Based Inhibitors of the Low-Molecular-Weight Protein Tyrosine Phosphatase. J Med Chem 64:5645-5653 (2021)  
Target
Name:
Low molecular weight phosphotyrosine protein phosphatase
Synonyms:
3.1.3.2 ACP1 LMW-PTP LMWPTP PPAC_HUMAN low molecular weight phosphotyrosine protein phosphatase isoform c
Type:
Mol. Mass.:
18042.81
Organism:
Homo sapiens (Human)
Description:
P24666
Residue:
158
  
Inhibitor
Name:
BDBM50576941
Synonyms:
CHEMBL4875137
Type:
Small organic molecule
Emp. Form.:
C18H14Cl2N6
Mol. Mass.:
385.25
SMILES:
Cc1ccccc1-c1nc2c(N)ncn(Cc3c(Cl)cncc3Cl)c2n1
: