Target
Coagulation factor X
Ligand
BDBM50144136
Substrate
Meas. Tech.
ChEBML_48628
IC50
8±n/a nM
Citation
 Jia, ZJSu, TZuckett, JFWu, YGoldman, EALi, WZhang, PClizbe, LASong, YBauer, SMHuang, WWoolfrey, JSinha, UArfsten, AEHutchaleelaha, AHollenbach, SJLambing, JLScarborough, RMZhu, BY N,N-Dialkylated 4-(4-arylsulfonylpiperazine-1-carbonyl)-benzamidines and 4-((4-arylsulfonyl)-2-oxo-piperazin-1-ylmethyl)-benzamidines as potent factor Xa inhibitors. Bioorg Med Chem Lett 14:2073-8 (2004)  
Target
Name:
Coagulation factor X
Synonyms:
Activated coagulation factor X (FXa) Coagulation factor X precursor F10 Factor X heavy chain Factor Xa Stuart-Prower factor
Type:
Enzyme
Mol. Mass.:
54726.60
Organism:
Homo sapiens (Human)
Description:
Residue:
488
  
Inhibitor
Name:
BDBM50144136
Synonyms:
2-{4-(5-Chloro-1H-indole-2-sulfonyl)-1-[4-(1-methyl-4,5-dihydro-1H-imidazol-2-yl)-benzoyl]-piperazin-2-yl}-1-(4-pyridin-4-yl-piperazin-1-yl)-ethanone | CHEMBL63672
Type:
Small organic molecule
Emp. Form.:
C34H37ClN8O4S
Mol. Mass.:
689.227
SMILES:
CN1CCN=C1c1ccc(cc1)C(=O)N1CCN(CC1CC(=O)N1CCN(CC1)c1ccncc1)S(=O)(=O)c1cc2cc(Cl)ccc2[nH]1
: