Target
Delta-type opioid receptor
Ligand
BDBM50144247
Substrate
Meas. Tech.
ChEMBL_145487 (CHEMBL752130)
Ki
0.500000±n/a nM
Citation
 Carson, JRCoats, SJCodd, EEDax, SLLee, JMartinez, RPNeilson, LAPitis, PMZhang, SP N,N-dialkyl-4-[(8-azabicyclo[3.2.1]-oct-3-ylidene)phenylmethyl]benzamides, potent, selective delta opioid agonists. Bioorg Med Chem Lett 14:2109-12 (2004)  
Target
Name:
Delta-type opioid receptor
Synonyms:
D-OR-1 Delta opioid receptor OPIATE Delta OPRD1 OPRK1 | opioid receptor, delta 1
Type:
G Protein-Coupled Receptor (GPCR)
Mol. Mass.:
40382.98
Organism:
Homo sapiens (Human)
Description:
Competition binding assays were carried out using membrane preparations from transfected HN9.10 cells that constitutively expressed the delta opioid receptor.
Residue:
372
  
Inhibitor
Name:
BDBM50144247
Synonyms:
4-[((1S,5R)-8-Allyl-8-aza-bicyclo[3.2.1]oct-3-yl)-phenyl-amino]-N,N-diethyl-benzamide | CHEMBL67545
Type:
Small organic molecule
Emp. Form.:
C27H35N3O
Mol. Mass.:
417.5863
SMILES:
CCN(CC)C(=O)c1ccc(cc1)N(C1C[C@@H]2CC[C@H](C1)N2CC=C)c1ccccc1
: