Target
Delta-type opioid receptor
Ligand
BDBM50144300
Substrate
Meas. Tech.
ChEBML_147341
Ki
22±n/a nM
Citation
 Carson, JRCoats, SJCodd, EEDax, SLLee, JMartinez, RPMcKown, LAAnne Neilson, LPitis, PMWu, WNZhang, SP N-alkyl-4-[(8-azabicyclo[3.2.1]-oct-3-ylidene)phenylmethyl]benzamides, micro and delta opioid agonists: a micro address. Bioorg Med Chem Lett 14:2113-6 (2004)  
Target
Name:
Delta-type opioid receptor
Synonyms:
D-OR-1 Delta opioid receptor OPIATE Delta OPRD1 OPRK1 | opioid receptor, delta 1
Type:
G Protein-Coupled Receptor (GPCR)
Mol. Mass.:
40382.98
Organism:
Homo sapiens (Human)
Description:
Competition binding assays were carried out using membrane preparations from transfected HN9.10 cells that constitutively expressed the delta opioid receptor.
Residue:
372
  
Inhibitor
Name:
BDBM50144300
Synonyms:
4-[(8-Phenethyl-8-aza-bicyclo[3.2.1]oct-3-ylidene)-phenyl-methyl]-N-propyl-benzamide | CHEMBL67615
Type:
Small organic molecule
Emp. Form.:
C32H36N2O
Mol. Mass.:
464.641
SMILES:
[#6]-[#6]-[#6]-[#7]-[#6](=O)-c1ccc(cc1)-[#6](=[#6]-1\[#6]-[#6]-2-[#6]-[#6]-[#6](-[#6]-1)-[#7]-2-[#6]-[#6]-c1ccccc1)\c1ccccc1
: