Target
STE20-like serine/threonine-protein kinase
Ligand
BDBM8244
Substrate
Meas. Tech.
ChEMBL_2129997 (CHEMBL4839426)
Ki
8.5±n/a nM
Citation
 Serafim, RAMSorrell, FJBerger, BTCollins, RJVasconcelos, SNSMassirer, KBKnapp, SBennett, JFedorov, OPatel, HZuercher, WJElkins, JM Discovery of a Potent Dual SLK/STK10 Inhibitor Based on a Maleimide Scaffold. J Med Chem 64:13259-13278 (2021)  
Target
Name:
STE20-like serine/threonine-protein kinase
Synonyms:
KIAA0204 SLK_HUMAN Serine/threonine-protein kinase 2
Type:
PROTEIN
Mol. Mass.:
142644.38
Organism:
Homo sapiens (Human)
Description:
ChEMBL_1451342
Residue:
1235
  
Inhibitor
Name:
BDBM8244
Synonyms:
3-[(3-chloro-4-hydroxyphenyl)amino]-4-(2-methoxyphenyl)-2,5-dihydro-1H-pyrrole-2,5-dione | 4-arylmaleimide deriv. 6-a
Type:
Small organic molecule
Emp. Form.:
C17H13ClN2O4
Mol. Mass.:
344.749
SMILES:
COc1ccccc1C1=C(Nc2ccc(O)c(Cl)c2)C(=O)NC1=O
: