Target
STE20-like serine/threonine-protein kinase
Ligand
BDBM8275
Substrate
Meas. Tech.
ChEMBL_2129997 (CHEMBL4839426)
Ki
21±n/a nM
Citation
 Serafim, RAMSorrell, FJBerger, BTCollins, RJVasconcelos, SNSMassirer, KBKnapp, SBennett, JFedorov, OPatel, HZuercher, WJElkins, JM Discovery of a Potent Dual SLK/STK10 Inhibitor Based on a Maleimide Scaffold. J Med Chem 64:13259-13278 (2021)  
Target
Name:
STE20-like serine/threonine-protein kinase
Synonyms:
KIAA0204 SLK_HUMAN Serine/threonine-protein kinase 2
Type:
PROTEIN
Mol. Mass.:
142644.38
Organism:
Homo sapiens (Human)
Description:
ChEMBL_1451342
Residue:
1235
  
Inhibitor
Name:
BDBM8275
Synonyms:
3-(2-methoxyphenyl)-4-{[4-(methylsulfanyl)phenyl]amino}-2,5-dihydro-1H-pyrrole-2,5-dione | 4-arylmaleimide deriv. 6ff
Type:
Small organic molecule
Emp. Form.:
C18H16N2O3S
Mol. Mass.:
340.396
SMILES:
COc1ccccc1C1=C(Nc2ccc(SC)cc2)C(=O)NC1=O
: