Target
STE20-like serine/threonine-protein kinase
Ligand
BDBM50577314
Substrate
Meas. Tech.
ChEMBL_2129997 (CHEMBL4839426)
Ki
40±n/a nM
Citation
 Serafim, RAMSorrell, FJBerger, BTCollins, RJVasconcelos, SNSMassirer, KBKnapp, SBennett, JFedorov, OPatel, HZuercher, WJElkins, JM Discovery of a Potent Dual SLK/STK10 Inhibitor Based on a Maleimide Scaffold. J Med Chem 64:13259-13278 (2021)  
Target
Name:
STE20-like serine/threonine-protein kinase
Synonyms:
KIAA0204 SLK_HUMAN Serine/threonine-protein kinase 2
Type:
PROTEIN
Mol. Mass.:
142644.38
Organism:
Homo sapiens (Human)
Description:
ChEMBL_1451342
Residue:
1235
  
Inhibitor
Name:
BDBM50577314
Synonyms:
CHEMBL347702
Type:
Small organic molecule
Emp. Form.:
C16H11ClN2O3
Mol. Mass.:
314.723
SMILES:
Oc1ccc(NC2=C(C(=O)NC2=O)c2ccccc2Cl)cc1
: