Target
STE20-like serine/threonine-protein kinase
Ligand
BDBM50577331
Substrate
Meas. Tech.
ChEMBL_2129997 (CHEMBL4839426)
Ki
29±n/a nM
Citation
 Serafim, RAMSorrell, FJBerger, BTCollins, RJVasconcelos, SNSMassirer, KBKnapp, SBennett, JFedorov, OPatel, HZuercher, WJElkins, JM Discovery of a Potent Dual SLK/STK10 Inhibitor Based on a Maleimide Scaffold. J Med Chem 64:13259-13278 (2021)  
Target
Name:
STE20-like serine/threonine-protein kinase
Synonyms:
KIAA0204 SLK_HUMAN Serine/threonine-protein kinase 2
Type:
PROTEIN
Mol. Mass.:
142644.38
Organism:
Homo sapiens (Human)
Description:
ChEMBL_1451342
Residue:
1235
  
Inhibitor
Name:
BDBM50577331
Synonyms:
CHEMBL4877101
Type:
Small organic molecule
Emp. Form.:
C21H13N3O2
Mol. Mass.:
339.3468
SMILES:
O=C1NC(=O)C(=C1Nc1cccc(c1)C#N)c1cccc2ccccc12
: