Target
STE20-like serine/threonine-protein kinase
Ligand
BDBM50577366
Substrate
Meas. Tech.
ChEMBL_2129997 (CHEMBL4839426)
Ki
17±n/a nM
Citation
 Serafim, RAMSorrell, FJBerger, BTCollins, RJVasconcelos, SNSMassirer, KBKnapp, SBennett, JFedorov, OPatel, HZuercher, WJElkins, JM Discovery of a Potent Dual SLK/STK10 Inhibitor Based on a Maleimide Scaffold. J Med Chem 64:13259-13278 (2021)  
Target
Name:
STE20-like serine/threonine-protein kinase
Synonyms:
KIAA0204 SLK_HUMAN Serine/threonine-protein kinase 2
Type:
PROTEIN
Mol. Mass.:
142644.38
Organism:
Homo sapiens (Human)
Description:
ChEMBL_1451342
Residue:
1235
  
Inhibitor
Name:
BDBM50577366
Synonyms:
CHEMBL4867952
Type:
Small organic molecule
Emp. Form.:
C22H20N4O4
Mol. Mass.:
404.4186
SMILES:
COc1cc(NC(=O)C(C)C)ccc1C1=C(Nc2cccc(c2)C#N)C(=O)NC1=O
: