Target
Glucocorticoid receptor
Ligand
BDBM19205
Substrate
Meas. Tech.
ChEMBL_2130771 (CHEMBL4840200)
IC50
0.251189±n/a nM
Citation
 Kennedy, BJLato, AMFisch, ARBurke, SJKirkland, JKPrevatte, CWDunlap, LESmith, RTVogiatzis, KDCollier, JJCampagna, SR Potent Anti-Inflammatory, Arylpyrazole-Based Glucocorticoid Receptor Agonists That Do Not Impair Insulin Secretion. ACS Med Chem Lett 12:1568-1577 (2021)  
Target
Name:
Glucocorticoid receptor
Synonyms:
GCR_RAT Glucocorticoid Receptor (GR) Grl | Nr3c1
Type:
Enzyme Catalytic Domain
Mol. Mass.:
87556.83
Organism:
RAT
Description:
Glucocorticoid 0 RAT::P06536
Residue:
795
  
Inhibitor
Name:
BDBM19205
Synonyms:
(1R)-1-[(4aR,5S)-1-(4-fluorophenyl)-4a-methyl-1H,4H,4aH,5H,6H,7H,8H-cyclohexa[f]indazol-5-yl]-2,2-dimethylpropan-1-ol | N-Arylpyrazolo[3,2-c]-Based Ligand, 29
Type:
Small organic molecule
Emp. Form.:
C23H29FN2O
Mol. Mass.:
368.4876
SMILES:
[H][C@@]1(CCCC2=Cc3c(C[C@]12C)cnn3-c1ccc(F)cc1)[C@@H](O)C(C)(C)C
: