Target
Beta-secretase 1
Ligand
BDBM50452874
Substrate
Meas. Tech.
ChEMBL_2132371 (CHEMBL4841886)
IC50
0.600000±n/a nM
Citation
 Kobayashi, KOtani, TIjiri, SKawasaki, YMatsubara, HMiyagi, TKitajima, TIseki, RIshizawa, KShindo, NOkawa, KUeda, KAndo, SKawakita, MHattori, YAkaji, K Structure-activity relationship study of hydroxyethylamine isostere and P1' site structure of peptide mimetic BACE1 inhibitors. Bioorg Med Chem 50:0 (2021)  
Target
Name:
Beta-secretase 1
Synonyms:
ASP2 Aspartyl protease 2 BACE1 Beta-secretase (BACE) Beta-secretase 1 (BACE 1) Beta-secretase 1 (BACE1) Beta-site amyloid precursor protein cleaving enzyme 1 Memapsin-2 beta-Secretase (BACE-1) | beta-Secretase (BACE1)
Type:
Protein
Mol. Mass.:
55755.10
Organism:
Homo sapiens (Human)
Description:
P56817
Residue:
501
  
Inhibitor
Name:
BDBM50452874
Synonyms:
CHEMBL4217620
Type:
Small organic molecule
Emp. Form.:
C26H28N4O
Mol. Mass.:
412.5267
SMILES:
CO[C@H]1CC[C@]2(Cc3ccc(cc3[C@@]22N=C(C)C(N)=N2)-c2cncc(c2)C#CC)CC1
: