Target
Mitogen-activated protein kinase 8
Ligand
BDBM50364378
Substrate
Meas. Tech.
ChEMBL_2132758 (CHEMBL4842273)
IC50
133±n/a nM
Citation
 Nagy, MAHilgraf, RMortensen, DSElsner, JNorris, STikhe, JYoon, WPaisner, DDelgado, MErdman, PHaelewyn, JKhambatta, GXu, LRomanow, WJCondroski, KBahmanyar, SMcCarrick, MBenish, BBlease, KLeBrun, LMoghaddam, MFApuy, JCanan, SSBennett, BLSatoh, Y Discovery of the c-Jun N-Terminal Kinase Inhibitor  J Med Chem 64:18193-18208 (2021)  
Target
Name:
Mitogen-activated protein kinase 8
Synonyms:
JNK-46 JNK1-alpha-1 MK08_HUMAN PRKM8 SAPK1C c-Jun N-terminal kinase 1 c-Jun N-terminal kinase 1(JNK1) | c-Jun N-terminal kinase 2 (JNK2)
Type:
Enzyme
Mol. Mass.:
48297.57
Organism:
Homo sapiens (Human)
Description:
JNK-1 was purchased from Upstate Cell Signaling Solutions (formerly Upstate Biotechnology).
Residue:
427
  
Inhibitor
Name:
BDBM50364378
Synonyms:
CHEMBL1950289
Type:
Small organic molecule
Emp. Form.:
C21H23F3N6O2
Mol. Mass.:
448.4415
SMILES:
O[C@H]1CC[C@@H](CC1)Nc1ncc2nc(Nc3c(F)cc(F)cc3F)n([C@H]3CCOC3)c2n1
: