Target
Acetyl-coenzyme A synthetase, cytoplasmic
Ligand
BDBM50578397
Substrate
Meas. Tech.
ChEMBL_2132787 (CHEMBL4842302)
IC50
1.000000±n/a nM
Citation
 Sabnis, RW Novel Substituted Tetrazoles as ACSS2 Inhibitors for Treating Cancer. ACS Med Chem Lett 12:1894-1895 (2021)  
Target
Name:
Acetyl-coenzyme A synthetase, cytoplasmic
Synonyms:
6.2.1.1 ACAS2 ACSA_HUMAN AceCS Acetate--CoA ligase Acetyl-CoA synthetase 1 Acyl-CoA synthetase short-chain family member 2 Propionate--CoA ligase
Type:
PROTEIN
Mol. Mass.:
78577.73
Organism:
Homo sapiens
Description:
ChEMBL_119217
Residue:
701
  
Inhibitor
Name:
BDBM50578397
Synonyms:
CHEMBL4855352 | US20240009175, Compound 33
Type:
Small organic molecule
Emp. Form.:
C20H18N8O2S
Mol. Mass.:
434.474
SMILES:
CCn1c(nc2nc(OC)c(cc12)-c1nnn[nH]1)C(O)(c1nccs1)c1ccccc1
: