Target
Acetyl-coenzyme A synthetase, cytoplasmic
Ligand
BDBM50578399
Substrate
Meas. Tech.
ChEMBL_2132787 (CHEMBL4842302)
IC50
1.000000±n/a nM
Citation
 Sabnis, RW Novel Substituted Tetrazoles as ACSS2 Inhibitors for Treating Cancer. ACS Med Chem Lett 12:1894-1895 (2021)  
Target
Name:
Acetyl-coenzyme A synthetase, cytoplasmic
Synonyms:
6.2.1.1 ACAS2 ACSA_HUMAN AceCS Acetate--CoA ligase Acetyl-CoA synthetase 1 Acyl-CoA synthetase short-chain family member 2 Propionate--CoA ligase
Type:
PROTEIN
Mol. Mass.:
78577.73
Organism:
Homo sapiens
Description:
ChEMBL_119217
Residue:
701
  
Inhibitor
Name:
BDBM50578399
Synonyms:
CHEMBL4870878 | US20240009175, Compound 37
Type:
Small organic molecule
Emp. Form.:
C21H19N9O2
Mol. Mass.:
429.4347
SMILES:
CCn1c(nc2nc(OC)c(cc12)-c1nnn[nH]1)C(O)(c1ccccc1)c1ncccn1
: