Target
Beta-2 adrenergic receptor
Ligand
BDBM50578599
Substrate
Meas. Tech.
ChEMBL_2133588 (CHEMBL4843198)
EC50
0.023442±n/a nM
Citation
 Xing, GZhi, ZYi, CZou, JJing, XYiu-Ho Woo, ALin, BPan, LZhang, YCheng, M 8-Hydroxyquinolin-2(1H)-one analogues as potential ? Eur J Med Chem 224:0 (2021)  
Target
Name:
Beta-2 adrenergic receptor
Synonyms:
ADRB2 ADRB2_HUMAN Beta-2 adrenoceptor | Beta-2 adrenoreceptor
Type:
Mol. Mass.:
46461.69
Organism:
Homo sapiens (Human)
Description:
P07550
Residue:
413
  
Inhibitor
Name:
BDBM50578599
Synonyms:
CHEMBL4868684
Type:
Small organic molecule
Emp. Form.:
C21H24ClFN2O3
Mol. Mass.:
406.878
SMILES:
Cl.CC(CCc1cccc(F)c1)NCC(O)c1ccc(O)c2[nH]c(=O)ccc12
: