Target
Beta-2 adrenergic receptor
Ligand
BDBM50578601
Substrate
Meas. Tech.
ChEMBL_2133588 (CHEMBL4843198)
EC50
0.017378±n/a nM
Citation
 Xing, GZhi, ZYi, CZou, JJing, XYiu-Ho Woo, ALin, BPan, LZhang, YCheng, M 8-Hydroxyquinolin-2(1H)-one analogues as potential ? Eur J Med Chem 224:0 (2021)  
Target
Name:
Beta-2 adrenergic receptor
Synonyms:
ADRB2 ADRB2_HUMAN Beta-2 adrenoceptor | Beta-2 adrenoreceptor
Type:
Mol. Mass.:
46461.69
Organism:
Homo sapiens (Human)
Description:
P07550
Residue:
413
  
Inhibitor
Name:
BDBM50578601
Synonyms:
CHEMBL4848018
Type:
Small organic molecule
Emp. Form.:
C22H27ClN2O3
Mol. Mass.:
402.914
SMILES:
Cl.CC(CCc1ccccc1C)NCC(O)c1ccc(O)c2[nH]c(=O)ccc12
: