Target
Type-1 angiotensin II receptor B
Ligand
BDBM50145982
Substrate
Meas. Tech.
ChEMBL_34817 (CHEMBL648961)
IC50
110±n/a nM
Citation
 Cappelli, APericot Mohr Gl, GGallelli, ARizzo, MAnzini, MVomero, SMennuni, LFerrari, FMakovec, FMenziani, MCDe Benedetti, PGGiorgi, G Design, synthesis, structural studies, biological evaluation, and computational simulations of novel potent AT(1) angiotensin II receptor antagonists based on the 4-phenylquinoline structure. J Med Chem 47:2574-86 (2004)  
Target
Name:
Type-1 angiotensin II receptor B
Synonyms:
AGTRB_RAT Agtr1 Angiotensin II AT1B Angiotensin II type 1b (AT-1b) receptor Type-1B angiotensin II receptor
Type:
Enzyme Catalytic Domain
Mol. Mass.:
40929.44
Organism:
RAT
Description:
Angiotensin II AT1B 0 RAT::P29089
Residue:
359
  
Inhibitor
Name:
BDBM50145982
Synonyms:
3-[4-(3,5-Dibutyl-[1,2,4]triazol-1-ylmethyl)-phenyl]-2-(1H-tetrazol-5-yl)-pyridine CHEMBL88067
Type:
Small organic molecule
Emp. Form.:
C23H28N8
Mol. Mass.:
416.522
SMILES:
CCCCc1nc(CCCC)n(Cc2ccc(cc2)-c2cccnc2-c2nnn[nH]2)n1
: