Target
Lysophosphatidic acid receptor 3
Ligand
BDBM50146254
Substrate
Meas. Tech.
ChEBML_100179
IC50
>10000±n/a nM
Citation
 Heasley, BHJarosz, RLynch, KRMacdonald, TL Initial structure-activity relationships of lysophosphatidic acid receptor antagonists: discovery of a high-affinity LPA1/LPA3 receptor antagonist. Bioorg Med Chem Lett 14:2735-40 (2004)  
Target
Name:
Lysophosphatidic acid receptor 3
Synonyms:
EDG7 LPAR3 Lysophosphatidic acid receptor 1/3 Lysophosphatidic acid receptor Edg-7
Type:
Enzyme
Mol. Mass.:
40149.72
Organism:
Homo sapiens (Human)
Description:
Q9UBY5
Residue:
353
  
Inhibitor
Name:
BDBM50146254
Synonyms:
CHEMBL327240 | Phosphoric acid mono-[(R)-3-(4-benzyloxy-phenyl)-2-((Z)-octadec-9-enoylamino)-propyl] ester
Type:
Small organic molecule
Emp. Form.:
C34H52NO6P
Mol. Mass.:
601.7535
SMILES:
CCCCCCCC\C=C/CCCCCCCC(=O)N[C@@H](COP(O)(O)=O)Cc1ccc(OCc2ccccc2)cc1
: