Target
C-X-C chemokine receptor type 4
Ligand
BDBM50443541
Substrate
Meas. Tech.
ChEMBL_2135895 (CHEMBL4845505)
IC50
6.3±n/a nM
Citation
 Nguyen, HHTahirovic, YATruax, VMWilson, RJJecs, EMiller, EJKim, MBAkins, NSXu, LJiang, YWang, TSum, CSCvijic, MESchroeder, GMWilson, LJLiotta, DC Amino-Heterocycle Tetrahydroisoquinoline CXCR4 Antagonists with Improved ADME Profiles via Late-Stage Buchwald Couplings. ACS Med Chem Lett 12:1605-1612 (2021)  
Target
Name:
C-X-C chemokine receptor type 4
Synonyms:
C-X-C chemokine receptor type 4 CD_antigen=CD184 CXCR-4 CXCR4_HUMAN Fusin LCR1 Leukocyte-derived seven transmembrane domain receptor SDF-1 receptor | Stromal cell-derived factor 1 receptor
Type:
Enzyme
Mol. Mass.:
39754.61
Organism:
Homo sapiens (Human)
Description:
P61073
Residue:
352
  
Inhibitor
Name:
BDBM50443541
Synonyms:
CHEMBL3091687
Type:
Small organic molecule
Emp. Form.:
C23H32N4
Mol. Mass.:
364.527
SMILES:
NCCCCN(C[C@H]1Cc2ccccc2CN1)[C@H]1CCCc2cccnc12
: