Target
Suppressor of tumorigenicity 14 protein
Ligand
BDBM50580342
Substrate
Meas. Tech.
ChEMBL_2148120 (CHEMBL5032466)
IC50
3.7±n/a nM
Citation
 Damalanka, VCVoss, JJLPMahoney, MWPrimeau, TLi, SKlampfer, LJanetka, JW Macrocyclic Inhibitors of HGF-Activating Serine Proteases Overcome Resistance to Receptor Tyrosine Kinase Inhibitors and Block Lung Cancer Progression. J Med Chem 64:18158-18174 (2021)  
Target
Name:
Suppressor of tumorigenicity 14 protein
Synonyms:
Epithin MT-SP1 PRSS14 SNC19 ST14_HUMAN Suppressor of tumorigenicity 14 protein TADG15
Type:
Single-pass type II membrane protein
Mol. Mass.:
94769.23
Organism:
Homo sapiens (Human)
Description:
Q9Y5Y6
Residue:
855
  
Inhibitor
Name:
BDBM50580342
Synonyms:
CHEMBL5088958
Type:
Small organic molecule
Emp. Form.:
C29H41N9O7S
Mol. Mass.:
659.757
SMILES:
C[C@@H](O)[C@@H]1NC(=O)[C@H](CC(=O)NCCCC[C@H](NC1=O)C(=O)N[C@@H](CCCNC(N)=N)C(=O)c1nc2ccccc2s1)NC(C)=O
: