Target
Serine protease hepsin
Ligand
BDBM50580331
Substrate
Meas. Tech.
ChEMBL_2148121 (CHEMBL5032467)
IC50
1.7±n/a nM
Citation
 Damalanka, VCVoss, JJLPMahoney, MWPrimeau, TLi, SKlampfer, LJanetka, JW Macrocyclic Inhibitors of HGF-Activating Serine Proteases Overcome Resistance to Receptor Tyrosine Kinase Inhibitors and Block Lung Cancer Progression. J Med Chem 64:18158-18174 (2021)  
Target
Name:
Serine protease hepsin
Synonyms:
HEPS_HUMAN Hepsin TMPRSS1 Transmembrane protease, serine 1
Type:
Enzyme
Mol. Mass.:
45016.98
Organism:
Homo sapiens (Human)
Description:
Human deglycosylated hepsin was expressed in Pichia pastoris.
Residue:
417
  
Inhibitor
Name:
BDBM50580331
Synonyms:
CHEMBL5083517
Type:
Small organic molecule
Emp. Form.:
C32H47N9O6S
Mol. Mass.:
685.837
SMILES:
CC(C)C[C@@H]1NC(=O)[C@H](CCCCNC(=O)CC[C@H](NC1=O)C(=O)N[C@@H](CCCNC(N)=N)C(=O)c1nc2ccccc2s1)NC(C)=O
: