Target
Serine protease hepsin
Ligand
BDBM50580346
Substrate
Meas. Tech.
ChEMBL_2148121 (CHEMBL5032467)
IC50
0.380000±n/a nM
Citation
 Damalanka, VCVoss, JJLPMahoney, MWPrimeau, TLi, SKlampfer, LJanetka, JW Macrocyclic Inhibitors of HGF-Activating Serine Proteases Overcome Resistance to Receptor Tyrosine Kinase Inhibitors and Block Lung Cancer Progression. J Med Chem 64:18158-18174 (2021)  
Target
Name:
Serine protease hepsin
Synonyms:
HEPS_HUMAN Hepsin TMPRSS1 Transmembrane protease, serine 1
Type:
Enzyme
Mol. Mass.:
45016.98
Organism:
Homo sapiens (Human)
Description:
Human deglycosylated hepsin was expressed in Pichia pastoris.
Residue:
417
  
Inhibitor
Name:
BDBM50580346
Synonyms:
CHEMBL5074750
Type:
Small organic molecule
Emp. Form.:
C36H57N11O8S
Mol. Mass.:
803.972
SMILES:
CC(C)C[C@H](NC(=O)[C@H](CCCCN)NC(=O)[C@H](CO)NC(C)=O)C(=O)N[C@@H](CCCNC(N)=N)C(=O)c1nc2ccc(cc2s1)C(=O)N[C@@H](C(C)C)C(N)=O
: