Target
Cathepsin B
Ligand
BDBM50148310
Substrate
Meas. Tech.
ChEBML_47415
IC50
72±n/a nM
Citation
 Boros, EEDeaton, DNHassell, AMMcFadyen, RBMiller, ABMiller, LRPaulick, MGShewchuk, LMThompson, JBWillard, DHWright, LL Exploration of the P2-P3 SAR of aldehyde cathepsin K inhibitors. Bioorg Med Chem Lett 14:3425-9 (2004)  
Target
Name:
Cathepsin B
Synonyms:
APP secretase CATB_HUMAN CTSB Cathepsin B light chain | Cathepsin B1
Type:
Enzyme
Mol. Mass.:
37819.69
Organism:
Homo sapiens (Human)
Description:
gi_63102437
Residue:
339
  
Inhibitor
Name:
BDBM50148310
Synonyms:
((S)-1-Formyl-pentyl)-carbamic acid (S)-1-benzyl-propyl ester | CHEMBL114462
Type:
Small organic molecule
Emp. Form.:
C17H25NO3
Mol. Mass.:
291.3853
SMILES:
CCCC[C@H](NC(=O)O[C@@H](CC)Cc1ccccc1)C=O
: