Target
Lysophosphatidic acid receptor 3
Ligand
BDBM50148353
Substrate
Meas. Tech.
ChEBML_100180
EC50
>5000±n/a nM
Citation
 Santos, WLHeasley, BHJarosz, RCarter, KMLynch, KRMacdonald, TL Synthesis and biological evaluation of phosphonic and thiophosphoric acid derivatives of lysophosphatidic acid. Bioorg Med Chem Lett 14:3473-6 (2004)  
Target
Name:
Lysophosphatidic acid receptor 3
Synonyms:
EDG7 LPAR3 Lysophosphatidic acid receptor 1/3 Lysophosphatidic acid receptor Edg-7
Type:
Enzyme
Mol. Mass.:
40149.72
Organism:
Homo sapiens (Human)
Description:
Q9UBY5
Residue:
353
  
Inhibitor
Name:
BDBM50148353
Synonyms:
(1-Hydroxy-3-octadec-9-enoylamino-1-phosphono-propyl)-phosphonic acid | CHEMBL117860
Type:
Small organic molecule
Emp. Form.:
C21H43NO8P2
Mol. Mass.:
499.5155
SMILES:
CCCCCCCC\C=C/CCCCCCCC(=O)NCCC(O)(P(O)(O)=O)P(O)(O)=O
: