Target
Lysophosphatidic acid receptor 3
Ligand
BDBM50148354
Substrate
Meas. Tech.
ChEBML_100180
EC50
>5000±n/a nM
Citation
 Santos, WLHeasley, BHJarosz, RCarter, KMLynch, KRMacdonald, TL Synthesis and biological evaluation of phosphonic and thiophosphoric acid derivatives of lysophosphatidic acid. Bioorg Med Chem Lett 14:3473-6 (2004)  
Target
Name:
Lysophosphatidic acid receptor 3
Synonyms:
EDG7 LPAR3 Lysophosphatidic acid receptor 1/3 Lysophosphatidic acid receptor Edg-7
Type:
Enzyme
Mol. Mass.:
40149.72
Organism:
Homo sapiens (Human)
Description:
Q9UBY5
Residue:
353
  
Inhibitor
Name:
BDBM50148354
Synonyms:
CHEMBL117663 | [1-Fluoro-3-((Z)-octadec-9-enoylamino)-propyl]-phosphonic acid
Type:
Small organic molecule
Emp. Form.:
C21H41FNO4P
Mol. Mass.:
421.5267
SMILES:
CCCCCCCC\C=C/CCCCCCCC(=O)NCCC(F)P(O)(O)=O
: