Target
Lysophosphatidic acid receptor 3
Ligand
BDBM50148352
Substrate
Meas. Tech.
ChEBML_100180
EC50
>5000±n/a nM
Citation
 Santos, WLHeasley, BHJarosz, RCarter, KMLynch, KRMacdonald, TL Synthesis and biological evaluation of phosphonic and thiophosphoric acid derivatives of lysophosphatidic acid. Bioorg Med Chem Lett 14:3473-6 (2004)  
Target
Name:
Lysophosphatidic acid receptor 3
Synonyms:
EDG7 LPAR3 Lysophosphatidic acid receptor 1/3 Lysophosphatidic acid receptor Edg-7
Type:
Enzyme
Mol. Mass.:
40149.72
Organism:
Homo sapiens (Human)
Description:
Q9UBY5
Residue:
353
  
Inhibitor
Name:
BDBM50148352
Synonyms:
CHEMBL325288 | [1-Hydroxy-3-((Z)-octadec-9-enoylamino)-propyl]-phosphonic acid
Type:
Small organic molecule
Emp. Form.:
C21H42NO5P
Mol. Mass.:
419.5356
SMILES:
CCCCCCCC\C=C/CCCCCCCC(=O)NCCC(=O)P(O)(O)O
: