Target
Histone acetyltransferase p300
Ligand
BDBM50580968
Substrate
Meas. Tech.
ChEMBL_2149501 (CHEMBL5033899)
IC50
1.7±n/a nM
Citation
 Ding, HPei, YLi, YXu, WMei, LHou, ZGuang, YCao, LLi, PCao, HBian, JChen, KLuo, CZhou, BZhang, TLi, ZYang, Y Design, synthesis and biological evaluation of a novel spiro oxazolidinedione as potent p300/CBP HAT inhibitor for the treatment of ovarian cancer. Bioorg Med Chem 52:0 (2021)  
Target
Name:
Histone acetyltransferase p300
Synonyms:
EP300 HIF1A/p300/CREB-binding protein P300
Type:
Protein
Mol. Mass.:
264223.04
Organism:
Homo sapiens (Human)
Description:
Q09472
Residue:
2414
  
Inhibitor
Name:
BDBM50580968
Synonyms:
CHEMBL5083020
Type:
Small organic molecule
Emp. Form.:
C28H28F2N4O5
Mol. Mass.:
538.5425
SMILES:
CNC(=O)Nc1cc2CC[C@@]3(OC(=O)N(CC(=O)N4Cc5ccc(F)cc5CC[C@H]4C4CC4)C3=O)c2cc1F
: