Target
Melanocortin receptor 4
Ligand
BDBM50148980
Substrate
Meas. Tech.
ChEBML_106507
Ki
1300±n/a nM
Citation
 Marsilje, THRoses, JBCalderwood, EFStroud, SGForsyth, NEBlackburn, CYowe, DLMiao, WDrabic, SVBohane, MDScott Daniels, JLi, PWu, LPatane, MAClaiborne, CF Synthesis and biological evaluation of imidazole-based small molecule antagonists of the melanocortin 4 receptor (MC4-R). Bioorg Med Chem Lett 14:3721-5 (2004)  
Target
Name:
Melanocortin receptor 4
Synonyms:
MC4-R MC4R_HUMAN Melanocortin receptor 4 (MC-4) Melanocortin receptor 4 (MC4R)
Type:
Enzyme
Mol. Mass.:
36949.50
Organism:
Homo sapiens (Human)
Description:
P32245
Residue:
332
  
Inhibitor
Name:
BDBM50148980
Synonyms:
2-{2-[2-(5-Bromo-2-methoxy-phenyl)-ethyl]-3-chloro-phenyl}-1-propyl-1H-imidazole | CHEMBL123113
Type:
Small organic molecule
Emp. Form.:
C21H22BrClN2O
Mol. Mass.:
433.769
SMILES:
CCCn1ccnc1-c1cccc(Cl)c1CCc1cc(Br)ccc1OC
: