Target
Melatonin receptor type 1A
Ligand
BDBM50149169
Substrate
Meas. Tech.
ChEBML_104948
Ki
0.700000±n/a nM
Citation
 Sun, LQChen, JBruce, MDeskus, JAEpperson, JRTakaki, KJohnson, GIben, LMahle, CDRyan, EXu, C Synthesis and structure-activity relationship of novel benzoxazole derivatives as melatonin receptor agonists. Bioorg Med Chem Lett 14:3799-802 (2004)  
Target
Name:
Melatonin receptor type 1A
Synonyms:
MTNR1A MTR1A_HUMAN Mel1a melatonin receptor Melatonin receptor Melatonin receptor type 1 (MT1) | Melatonin receptor type 1A
Type:
Enzyme
Mol. Mass.:
39392.94
Organism:
Homo sapiens (Human)
Description:
P48039
Residue:
350
  
Inhibitor
Name:
BDBM50149169
Synonyms:
CHEMBL127570 | Cyclopropanecarboxylic acid [3-(2-methyl-benzooxazol-7-yl)-propyl]-amide
Type:
Small organic molecule
Emp. Form.:
C15H18N2O2
Mol. Mass.:
258.3156
SMILES:
Cc1nc2cccc(CCCNC(=O)C3CC3)c2o1
: