Target
Melatonin receptor type 1B
Ligand
BDBM50149169
Substrate
Meas. Tech.
ChEBML_105276
Ki
2.7±n/a nM
Citation
 Sun, LQChen, JBruce, MDeskus, JAEpperson, JRTakaki, KJohnson, GIben, LMahle, CDRyan, EXu, C Synthesis and structure-activity relationship of novel benzoxazole derivatives as melatonin receptor agonists. Bioorg Med Chem Lett 14:3799-802 (2004)  
Target
Name:
Melatonin receptor type 1B
Synonyms:
MTNR1B Mel-1B-R Melatonin 1B Melatonin receptor type 1B | Melatonin receptor type 2 (MT2)
Type:
Enzyme
Mol. Mass.:
40203.54
Organism:
Homo sapiens (Human)
Description:
P49286
Residue:
362
  
Inhibitor
Name:
BDBM50149169
Synonyms:
CHEMBL127570 | Cyclopropanecarboxylic acid [3-(2-methyl-benzooxazol-7-yl)-propyl]-amide
Type:
Small organic molecule
Emp. Form.:
C15H18N2O2
Mol. Mass.:
258.3156
SMILES:
Cc1nc2cccc(CCCNC(=O)C3CC3)c2o1
: