Target
Dual specificity tyrosine-phosphorylation-regulated kinase 4
Ligand
BDBM50581213
Substrate
Meas. Tech.
ChEMBL_2150119 (CHEMBL5034581)
IC50
1600±n/a nM
Citation
 Lee Walmsley, DMurray, JBDokurno, PMassey, AJBenwell, KFiumana, AFoloppe, NRay, SSmith, JSurgenor, AEEdmonds, TDemarles, DBurbridge, MCruzalegui, FKotschy, AHubbard, RE Fragment-Derived Selective Inhibitors of Dual-Specificity Kinases DYRK1A and DYRK1B. J Med Chem 64:8971-8991 (2021)  
Target
Name:
Dual specificity tyrosine-phosphorylation-regulated kinase 4
Synonyms:
DYRK4 | DYRK4_HUMAN
Type:
PROTEIN
Mol. Mass.:
59629.96
Organism:
Homo sapiens (Human)
Description:
ChEMBL_1475744
Residue:
520
  
Inhibitor
Name:
BDBM50581213
Synonyms:
CHEMBL5088687
Type:
Small organic molecule
Emp. Form.:
C18H16FN7
Mol. Mass.:
349.3649
SMILES:
Cc1nc(NCc2ncccc2F)c2c(c[nH]c2n1)-c1ccnc(N)c1
: