Target
Protein-arginine deiminase type-4
Ligand
BDBM50581617
Substrate
Meas. Tech.
ChEMBL_2151759 (CHEMBL5036221)
IC50
6.0±n/a nM
Citation
 Sabnis, RW Novel Macrocyclic Peptidylarginine Deiminase Type 4 (PAD4) Inhibitors. ACS Med Chem Lett 13:27-28 (2022)  
Target
Name:
Protein-arginine deiminase type-4
Synonyms:
PAD4 PADI4_HUMAN PDI5
Type:
Enzyme Catalytic Domain
Mol. Mass.:
74078.90
Organism:
Homo sapiens (Human)
Description:
gi_216548487
Residue:
663
  
Inhibitor
Name:
BDBM50581617
Synonyms:
CHEMBL5093574
Type:
Small organic molecule
Emp. Form.:
C39H43FN8O2
Mol. Mass.:
674.8095
SMILES:
[H][C@@]12CC[C@@]([H])(C1)N(C[C@@H]2N)C(=O)c1cc(F)c2n(C3CC3)c(nc2c1)-c1cc2ccc3nc2n1CCCCCc1nc(C)ccc1C(=O)NC3C
: