Target
Protein-arginine deiminase type-4
Ligand
BDBM50581618
Substrate
Meas. Tech.
ChEMBL_2151759 (CHEMBL5036221)
IC50
5.0±n/a nM
Citation
 Sabnis, RW Novel Macrocyclic Peptidylarginine Deiminase Type 4 (PAD4) Inhibitors. ACS Med Chem Lett 13:27-28 (2022)  
Target
Name:
Protein-arginine deiminase type-4
Synonyms:
PAD4 PADI4_HUMAN PDI5
Type:
Enzyme Catalytic Domain
Mol. Mass.:
74078.90
Organism:
Homo sapiens (Human)
Description:
gi_216548487
Residue:
663
  
Inhibitor
Name:
BDBM50581618
Synonyms:
CHEMBL5070220
Type:
Small organic molecule
Emp. Form.:
C35H39F4N7O2
Mol. Mass.:
665.7235
SMILES:
[H][C@@]12C[C@@]1(F)CCCC(F)(F)Cn1c(cc3ccc(nc13)C(C)NC2=O)-c1nc2cc(cc(F)c2n1C1CC1)C(=O)N1CCC[C@@H](N)[C@H]1C
: