Target
Protein-arginine deiminase type-4
Ligand
BDBM50581621
Substrate
Meas. Tech.
ChEMBL_2151759 (CHEMBL5036221)
IC50
5.0±n/a nM
Citation
 Sabnis, RW Novel Macrocyclic Peptidylarginine Deiminase Type 4 (PAD4) Inhibitors. ACS Med Chem Lett 13:27-28 (2022)  
Target
Name:
Protein-arginine deiminase type-4
Synonyms:
PAD4 PADI4_HUMAN PDI5
Type:
Enzyme Catalytic Domain
Mol. Mass.:
74078.90
Organism:
Homo sapiens (Human)
Description:
gi_216548487
Residue:
663
  
Inhibitor
Name:
BDBM50581621
Synonyms:
CHEMBL5087104
Type:
Small organic molecule
Emp. Form.:
C39H41FN8O2S
Mol. Mass.:
704.859
SMILES:
C[C@@H]1[C@H](N)CCCN1C(=O)c1cc(F)c2n(C3CC3)c(nc2c1)-c1cc2ccc3nc2n1CCCCCc1nc2ccsc2cc1C(=O)NC3C
: