Target
Proprotein convertase subtilisin/kexin type 9
Ligand
BDBM200318
Substrate
Meas. Tech.
ChEMBL_2151768 (CHEMBL5036230)
IC50
780±n/a nM
Citation
 Chappie, TAAbdelmessih, MAmbroise, CWBoehm, MCai, MGreen, MGuilmette, ESteppan, CMStevens, LMWei, LXi, SHasson, SA Discovery of Small-Molecule CD33 Pre-mRNA Splicing Modulators. ACS Med Chem Lett 13:55-62 (2022)  
Target
Name:
Proprotein convertase subtilisin/kexin type 9
Synonyms:
NARC-1 Neural apoptosis-regulated convertase 1 PCSK9 Proprotein convertase 9 Proprotein convertase subtilisin/kexin type 9 (PCSK9) Subtilisin/kexin-like protease PC9
Type:
Enzyme
Mol. Mass.:
74286.93
Organism:
Homo sapiens (Human)
Description:
Q8NBP7
Residue:
692
  
Inhibitor
Name:
BDBM200318
Synonyms:
US9227956, 3
Type:
Small organic molecule
Emp. Form.:
C23H22ClN7O
Mol. Mass.:
447.92
SMILES:
Cc1cnc2n(nnc2c1)-c1ccc(cc1)C(=O)N([C@@H]1CCCNC1)c1ncccc1Cl
: