Target
Adenosine receptor A1
Ligand
BDBM50581955
Substrate
Meas. Tech.
ChEMBL_2152682 (CHEMBL5037229)
Ki
0.500000±n/a nM
Citation
 Trinh, PNHChong, DJWLeach, KHill, SJTyndall, JDAMay, LTVernall, AJGregory, KJ Development of Covalent, Clickable Probes for Adenosine A J Med Chem 64:8161-8178 (2021)  
Target
Name:
Adenosine receptor A1
Synonyms:
A1 adenosine receptor (hA1) AA1R_HUMAN ADORA1 Adenosine A1-receptor Adenosine receptor A1 (hA1) | Adenosine transporter (AdT)
Type:
G Protein-Coupled Receptor (GPCR)
Mol. Mass.:
36520.92
Organism:
Homo sapiens (Human)
Description:
P30542
Residue:
326
  
Inhibitor
Name:
BDBM50581955
Synonyms:
CHEMBL5073669
Type:
Small organic molecule
Emp. Form.:
C31H40FN9O6S
Mol. Mass.:
685.769
SMILES:
CCCCn1c(=O)n(CCCNC(=O)c2ccc(cc2)S(F)(=O)=O)c2[nH]c(nc2c1=O)C12CCC(CC1)(CC2)C(=O)NCCCN=[N+]=[N-]
: