Target
Adenosine receptor A2a
Ligand
BDBM50094037
Substrate
Meas. Tech.
ChEMBL_2152685 (CHEMBL5037232)
Ki
0.300000±n/a nM
Citation
 Trinh, PNHChong, DJWLeach, KHill, SJTyndall, JDAMay, LTVernall, AJGregory, KJ Development of Covalent, Clickable Probes for Adenosine A J Med Chem 64:8161-8178 (2021)  
Target
Name:
Adenosine receptor A2a
Synonyms:
A2A adenosine receptor (hA2A) ADENOSINE A2 ADORA2 Adenosine A2A receptor (A2AAR)
Type:
G Protein-Coupled Receptor (GPCR)
Mol. Mass.:
44716.46
Organism:
Homo sapiens (Human)
Description:
P29274
Residue:
412
  
Inhibitor
Name:
BDBM50094037
Synonyms:
2-Furan-2-yl-7-[3-(4-methoxy-phenyl)-propyl]-7H-pyrazolo[4,3-e][1,2,4]triazolo[1,5-c]pyrimidin-5-ylamine SCH-442416
Type:
Small organic molecule
Emp. Form.:
C20H19N7O2
Mol. Mass.:
389.4106
SMILES:
COc1ccc(CCCn2ncc3c2nc(N)n2nc(nc32)-c2ccco2)cc1
: