Target
Phenylethanolamine N-methyltransferase
Ligand
BDBM50151338
Substrate
Meas. Tech.
ChEMBL_303718 (CHEMBL829053)
Ki
560.0±n/a nM
Citation
 Romero, FAVodonick, SMCriscione, KRMcLeish, MJGrunewald, GL Inhibitors of phenylethanolamine N-methyltransferase that are predicted to penetrate the blood-brain barrier: design, synthesis, and evaluation of 3-fluoromethyl-7-(N-substituted aminosulfonyl)-1,2,3,4-tetrahydroisoquinolines that possess low affinity toward the alpha2-adrenoceptor. J Med Chem 47:4483-93 (2004)  
Target
Name:
Phenylethanolamine N-methyltransferase
Synonyms:
Noradrenaline N-methyltransferase PNMT PNMTase | Phenylethanolamine N-Methyltransferase (PNMT)
Type:
Enzyme
Mol. Mass.:
30852.66
Organism:
Homo sapiens (Human)
Description:
Residue:
282
  
Inhibitor
Name:
BDBM50151338
Synonyms:
3-Fluoromethyl-1,2,3,4-tetrahydro-isoquinoline-7-sulfonic acid (2-ethoxy-ethyl)-amide | CHEMBL185992
Type:
Small organic molecule
Emp. Form.:
C14H21FN2O3S
Mol. Mass.:
316.392
SMILES:
CCOCCNS(=O)(=O)c1ccc2CC(CF)NCc2c1
: