Target
Small conductance calcium-activated potassium channel protein 2
Ligand
BDBM50275157
Substrate
Meas. Tech.
ChEMBL_2156785 (CHEMBL5041445)
EC50
7480±n/a nM
Citation
 El-Sayed, NSNam, YWEgorova, PANguyen, HMOrfali, RRahman, MAYang, GWulff, HBezprozvanny, IParang, KZhang, M Structure-Activity Relationship Study of Subtype-Selective Positive Modulators of K J Med Chem 65:303-322 (2022)  
Target
Name:
Small conductance calcium-activated potassium channel protein 2
Synonyms:
KCNN2_RAT Small conductance calcium-activated potassium channel Small conductance calcium-activated potassium channel protein 2 (KCa2.2)
Type:
Protein
Mol. Mass.:
63876.72
Organism:
Rattus norvegicus (Rat)
Description:
P70604
Residue:
580
  
Inhibitor
Name:
BDBM50275157
Synonyms:
CHEMBL453730 | N-cyclohexyl-2-(3,5-dimethyl-1H-pyrazol-1-yl)-6-methylpyrimidin-4-amine
Type:
Small organic molecule
Emp. Form.:
C16H23N5
Mol. Mass.:
285.3873
SMILES:
Cc1cc(C)n(n1)-c1nc(C)cc(NC2CCCCC2)n1
: