Target
Small conductance calcium-activated potassium channel protein 2
Ligand
BDBM50583206
Substrate
Meas. Tech.
ChEMBL_2156785 (CHEMBL5041445)
EC50
>100000±n/a nM
Citation
 El-Sayed, NSNam, YWEgorova, PANguyen, HMOrfali, RRahman, MAYang, GWulff, HBezprozvanny, IParang, KZhang, M Structure-Activity Relationship Study of Subtype-Selective Positive Modulators of K J Med Chem 65:303-322 (2022)  
Target
Name:
Small conductance calcium-activated potassium channel protein 2
Synonyms:
KCNN2_RAT Small conductance calcium-activated potassium channel Small conductance calcium-activated potassium channel protein 2 (KCa2.2)
Type:
Protein
Mol. Mass.:
63876.72
Organism:
Rattus norvegicus (Rat)
Description:
P70604
Residue:
580
  
Inhibitor
Name:
BDBM50583206
Synonyms:
CHEMBL5079218
Type:
Small organic molecule
Emp. Form.:
C19H19F2N5O2
Mol. Mass.:
387.3833
SMILES:
Cc1cc(C)n(n1)-c1nc(C)cc(N[C@@H](Cc2ccc(F)c(F)c2)C(O)=O)n1
: