Target
5-hydroxytryptamine receptor 1A
Ligand
BDBM50151935
Substrate
Meas. Tech.
ChEBML_306314
IC50
4±n/a nM
Citation
 Heinrich, TBöttcher, HBartoszyk, GDGreiner, HESeyfried, CAVan Amsterdam, C Indolebutylamines as selective 5-HT(1A) agonists. J Med Chem 47:4677-83 (2004)  
Target
Name:
5-hydroxytryptamine receptor 1A
Synonyms:
5-HT-1A 5-HT1A 5-hydroxytryptamine receptor 1A (5HT1A) 5ht1a Htr1a Serotonin 1a (5-HT1a) receptor/Adrenergic receptor alpha-1 | Serotonin receptor 1A
Type:
G Protein-Coupled Receptor (GPCR)
Mol. Mass.:
46445.29
Organism:
Rattus norvegicus (rat)
Description:
Binding assays were performed using rat hippocampal membranes.
Residue:
422
  
Inhibitor
Name:
BDBM50151935
Synonyms:
5-Methoxy-3-{4-[4-(4-methoxy-phenyl)-piperazin-1-yl]-butyl}-1H-indole | CHEMBL187196
Type:
Small organic molecule
Emp. Form.:
C24H31N3O2
Mol. Mass.:
393.5218
SMILES:
COc1ccc(cc1)N1CCN(CCCCc2c[nH]c3ccc(OC)cc23)CC1
: