Target
Amyloid-beta precursor protein
Ligand
BDBM50583322
Substrate
Meas. Tech.
ChEMBL_2157070 (CHEMBL5041730)
IC50
1.000000±n/a nM
Citation
 Peschiulli, AOehlrich, DVan Gool, MAustin, NVan Brandt, SSurkyn, MDe Cleyn, MVos, ATresadern, GRombouts, FJRMacdonald, GJMoechars, DTrabanco, AAGijsen, HJM A Brain-Penetrant and Bioavailable Pyrazolopiperazine BACE1 Inhibitor Elicits Sustained Reduction of Amyloid ? In Vivo. ACS Med Chem Lett 13:76-83 (2022)  
Target
Name:
Amyloid-beta precursor protein
Synonyms:
A4 ABPP AICD-50 AICD-59 AID(57) APP Alzheimer disease amyloid protein Amyloid beta Protein Amyloid beta protein Abeta(1-42) Amyloid intracellular domain 57 Amyloid protein (Abeta42b) Beta amyloid A4 protein Beta-APP42 Beta-amyloid protein 42 C83 CVAP Gamma Secretase Gamma-CTF(57) Gamma-secretase Gamma-secretase C-terminal fragment 57 P3(40) PN-II Protease nexin-II S-APP-beta Soluble APP-beta | beta-Amyloid Precursor Protein (APP)
Type:
Single-pass type I membrane protein
Mol. Mass.:
86890.41
Organism:
Homo sapiens (Human)
Description:
P05067
Residue:
770
  
Inhibitor
Name:
BDBM50583322
Synonyms:
CHEMBL5093303
Type:
Small organic molecule
Emp. Form.:
C21H16F3N7O2
Mol. Mass.:
455.3926
SMILES:
C[C@]1(Cn2nc(cc2C(N)=N1)C#N)c1cc(NC(=O)c2ccc(OC(F)F)cn2)ccc1F
: