Target
Platelet-derived growth factor receptor beta
Ligand
BDBM50152345
Substrate
Meas. Tech.
ChEMBL_306667 (CHEMBL832268)
IC50
180±n/a nM
Citation
 Heath, JAMehrotra, MMChi, SYu, JCHutchaleelaha, AHollenbach, SJGiese, NAScarborough, RMPandey, A Identification of 4-piperazin-1-yl-quinazoline template based aryl and benzyl thioureas as potent, selective, and orally bioavailable inhibitors of platelet-derived growth factor (PDGF) receptor. Bioorg Med Chem Lett 14:4867-72 (2004)  
Target
Name:
Platelet-derived growth factor receptor beta
Synonyms:
Beta-type platelet-derived growth factor receptor CD140b antigen PDGF Receptor Substrate PDGFR PDGFR-1 PDGFRB PGFRB_HUMAN Platelet-derived growth factor receptor 1 Platelet-derived growth factor receptor beta (PDGFR-beta) Platelet-derived growth factor receptor beta (PDGFRbeta) | VHL/PDGFRB
Type:
Enzyme
Mol. Mass.:
123922.25
Organism:
Homo sapiens (Human)
Description:
P09619
Residue:
1106
  
Inhibitor
Name:
BDBM50152345
Synonyms:
4-[6-Methoxy-7-(2-morpholin-4-yl-ethoxy)-quinazolin-4-yl]-piperazine-1-carbothioic acid (4-bromo-phenyl)-amide | CHEMBL186923
Type:
Small organic molecule
Emp. Form.:
C26H31BrN6O3S
Mol. Mass.:
587.532
SMILES:
COc1cc2c(ncnc2cc1OCCN1CCOCC1)N1CCN(CC1)C(=S)Nc1ccc(Br)cc1
: