Target
Melanin-concentrating hormone receptor 1
Ligand
BDBM50153228
Substrate
Meas. Tech.
ChEMBL_306754 (CHEMBL832647)
IC50
12000±n/a nM
Citation
 Receveur, JMBjurling, EUlven, TLittle, PBNørregaard, PKHögberg, T 4-Acylamino-and 4-ureidobenzamides as melanin-concentrating hormone (MCH) receptor 1 antagonists. Bioorg Med Chem Lett 14:5075-80 (2004)  
Target
Name:
Melanin-concentrating hormone receptor 1
Synonyms:
G-protein coupled receptor 24 MCH receptor 1 MCH-R1 MCHR-1 MCHR1_HUMAN Melanin-Concentrating Hormone Receptor 1 (MCH1R) Melanin-concentrating hormone receptor 1 (MCH-1) Melanin-concentrating hormone receptor 1 (MCHR-1) SLC-1 Somatostatin receptor-like protein
Type:
G Protein-Coupled Receptor (GPCR)
Mol. Mass.:
45976.27
Organism:
Homo sapiens (Human)
Description:
Membranes from CHO-K1 cells stably expressing human MCH1R were used in assays.
Residue:
422
  
Inhibitor
Name:
BDBM50153228
Synonyms:
Biphenyl-4-carboxylic acid [4-(2-dimethylamino-ethylcarbamoyl)-3-methoxy-phenyl]-amide | CHEMBL187288
Type:
Small organic molecule
Emp. Form.:
C25H27N3O3
Mol. Mass.:
417.5002
SMILES:
COc1cc(NC(=O)c2ccc(cc2)-c2ccccc2)ccc1C(=O)NCCN(C)C
: